{"text_format":"1","workbook":"xlsx","n_sheets":25,"sheets":["Intro","Dashboard","Input data review","Data input check","BoQ core input","BoQ optional input","Proj transport Liq Fuel input","Soil excavation input","Overheads input","Person-days input","Project input","Office input","Custom carbon factor input","Overheads db","Standard carbon factor database","Emissions db","BoQ carbon factor db","userName","Carbon factor dropdowns","Conversion factors","Clients_projects","Locations_projects","Emission table","FrontSheet","Summary"],"not_rendered":{"charts":13,"images":17,"macros":1,"external_links":1,"defined_names":224,"comments":0,"pivot_tables":0},"unopened":[],"bounds":{"document_bytes":16777216,"sheet_cells":100000,"rows_first":2000,"rows_last":500,"rows_between":2000,"halvings":0,"cell_chars":16384,"cell_head_chars":4096},"cells_cut":0,"cells_raw":0,"read":"whole","date_system":"1900"}

{"sheet":"Intro","index":0,"n_rows":46,"n_cols":5,"rows_kept":46,"cut":false,"hidden":false,"merged":[[45,2,45,3],[45,4,45,16],[4,2,4,16],[6,2,6,16],[7,2,7,16],[10,2,10,16],[8,2,8,16],[44,2,44,3],[44,4,44,16],[43,2,43,3],[43,4,43,16],[11,2,11,16],[41,2,41,3],[41,4,41,16],[42,2,42,3],[42,4,42,16],[39,2,39,16],[40,2,40,3],[40,4,40,16]]}
[]
[]
[]
[]
[null,null,"FAME Carbon Calculator"]
[]
[null,null,"Introduction"]
[null,null,"•\tTool Overview: Designed to help archaeology organisations set baselines, track carbon footprints and comply with PAS 2080 requirements. \n•\tPurpose: Create project-specific carbon footprints that can be aggregated by clients, geographic locations and as organisation totals (forecast and actual) to analyse performance, set baselines, identify high-carbon activities, set targets, and track carbon reduction progress.\n•\tBest Usability: Use Excel 2021 or later on Windows for optimal performance."]
[null,null,"The dashboard is the main tab where you can view and summarise carbon footprint data.\nView Options: \n•\tWhole company (within a specified time period)\n•\tSpecific project (within a specified time period)\n•\tClient (carbon footprint of all projects for a specific client within a specified time period)\n•\tLocation (carbon footprint of all projects for a specific location within a specified time period)\nExport Data: Export data as CSV for client reporting. "]
[]
{"$rows_left_out":37}
{"sheet":"Dashboard","index":1,"n_rows":83,"n_cols":21,"rows_kept":83,"cut":false,"hidden":false,"merged":[[18,1,18,3],[18,17,18,20],[4,1,4,12],[8,2,8,3],[8,18,8,20],[9,2,9,3],[9,18,9,20],[10,2,10,3],[10,18,10,20],[11,18,11,20],[13,1,13,3],[13,17,13,20],[15,1,15,3],[15,17,15,20],[21,1,21,3],[21,17,21,20],[49,2,49,4],[49,18,49,20],[50,2,50,4],[50,18,50,20],[51,2,51,4],[51,18,51,20],[52,2,52,4],[52,18,52,20],[55,1,55,4],[55,17,55,20],[57,1,57,4],[57,17,57,20],[60,1,60,4],[60,17,60,20],[63,1,63,4],[63,17,63,20]]}
[]
[]
[]
[]
[null,"Dashboard"]
[]
[null,"Overall carbon footprint",null,null,null,null,null,null,null,null,null,null,null,null,null,null,null,"Project carbon footprint"]
[]
[null,"Market/locational",null,null,null,null,null,null,null,null,null,null,null,null,null,null,null,"Project name"]
[null,"Start date",null,null,null,null,null,null,null,null,null,null,null,null,null,null,null,"Market/locational"]
{"$rows_left_out":74}
{"sheet":"Input data review","index":2,"n_rows":10,"n_cols":10,"rows_kept":10,"cut":false,"hidden":false,"merged":[[5,4,5,7],[8,6,8,7],[8,8,8,9]]}
[]
[]
[]
[]
[]
[null,null,null,"Project name"]
[null,null,null,"Please note that this will return only direct project inputs. Overheads will not be returned as these are shared between different projects"]
[]
[null,null,null,null,null,null,"Archaeology only quantity",null,"Archaeology and other development"]
[null,null,"Unique Code","Input Sheet","Input Type","Unit","Forecast","Actual","Forecast ","Actual "]
{"$rows_left_out":1}
{"sheet":"Data input check","index":3,"n_rows":22,"n_cols":23,"rows_kept":22,"cut":false,"hidden":false,"merged":[[18,3,18,6],[18,7,18,12],[18,13,18,22],[12,7,12,12],[4,1,4,12],[7,7,7,12],[8,7,8,12],[9,7,9,12],[10,7,10,12],[11,7,11,12],[11,2,11,6],[12,2,12,6],[7,2,7,6],[8,2,8,6],[9,2,9,6],[10,2,10,6]]}
[]
[]
[]
[]
[null,"Data input check"]
[]
[]
[null,null,"Do you want to check data inputs for a project or a time period?",null,null,null,null,"Project"]
[null,null,"Project name",null,null,null,null,"Project - Master"]
[null,null,"Start month",null,null,null,null,4]
{"$rows_left_out":13}
{"sheet":"BoQ core input","index":4,"n_rows":147,"n_cols":9,"rows_kept":147,"cut":false,"hidden":false,"merged":[[19,2,21,2],[13,1,13,2],[4,1,4,3],[8,1,8,2],[9,1,9,2],[10,1,10,2],[11,2,12,2]]}
[]
[]
[]
[]
[null,"Core bill of quantities input"]
[]
[]
[]
[null,"Name of person inputting the data"]
[null,"Project code",null,""]
{"$rows_left_out":138}
{"sheet":"BoQ optional input","index":5,"n_rows":66,"n_cols":9,"rows_kept":66,"cut":false,"hidden":false,"merged":[[4,1,4,6],[8,1,8,2],[8,3,8,5],[9,1,9,2],[9,3,9,5],[13,3,13,5],[19,3,19,5],[25,1,25,8],[26,1,26,8],[10,1,10,2],[10,3,10,5],[18,2,20,2],[18,3,18,5],[20,3,20,5],[11,2,12,2],[11,3,11,5],[12,3,12,5],[13,1,13,2]]}
[]
[]
[]
[]
[null,"Optional bill of quantities input"]
[]
[]
[]
[null,"Name of person inputting the data"]
[null,"Project code",null,""]
{"$rows_left_out":57}
{"sheet":"Proj transport Liq Fuel input","index":6,"n_rows":96,"n_cols":9,"rows_kept":96,"cut":false,"hidden":false,"merged":[[52,7,54,7],[52,8,54,11],[4,1,4,6],[46,8,48,11],[46,7,48,7],[49,7,51,7],[49,8,51,11],[8,1,8,2],[8,3,8,5],[10,1,10,2],[10,3,10,5],[11,2,12,2],[11,3,11,5],[12,3,12,5],[9,1,9,2],[9,3,9,5],[13,1,13,2],[13,3,13,5],[18,2,19,2],[18,3,18,5],[19,3,19,5],[94,3,94,4],[27,1,27,3],[28,1,28,3],[29,1,29,3],[30,1,30,3],[85,1,85,4],[44,1,44,5],[32,1,32,3],[81,1,81,4],[82,1,82,4],[83,1,83,4],[31,1,31,3],[94,1,94,2],[55,7,57,7],[55,8,57,11],[58,7,60,7],[58,8,60,11],[61,7,63,7],[61,8,63,11]]}
[]
[]
[]
[]
[null,"Project transport input"]
[]
[]
[]
[null,"Name of person inputting the data"]
[null,"Project code"]
{"$rows_left_out":87}
{"sheet":"Soil excavation input","index":7,"n_rows":41,"n_cols":16,"rows_kept":41,"cut":false,"hidden":false,"merged":[[10,1,10,2],[10,3,10,5],[27,1,27,2],[11,2,12,2],[11,3,11,5],[12,3,12,5],[13,1,13,2],[13,3,13,5],[18,2,19,2],[18,3,18,5],[19,3,19,5],[8,1,8,2],[8,3,8,5],[9,1,9,2],[9,3,9,5],[4,1,4,5],[28,1,28,2],[26,7,26,10],[26,11,26,14],[29,7,29,10],[29,11,29,14],[26,1,26,2],[33,7,33,10],[31,7,31,10],[26,15,26,18],[29,15,29,18],[27,7,28,10],[27,11,28,14],[27,15,28,18],[30,7,30,10],[30,11,30,14]]}
[]
[]
[]
[]
[null,"Soil excavation input"]
[]
[]
[]
[null,"Name of person inputting the data"]
[null,"Project code"]
{"$rows_left_out":32}
{"sheet":"Overheads input","index":8,"n_rows":109,"n_cols":6,"rows_kept":109,"cut":false,"hidden":false,"merged":[[107,3,107,4],[57,1,57,3],[12,3,12,5],[12,1,12,2],[16,3,16,5],[16,2,17,2],[17,3,17,5],[107,1,107,2],[75,1,75,2],[98,1,98,2],[8,1,8,2],[8,3,8,5],[4,1,4,4],[10,2,11,2],[9,1,9,2],[9,3,9,5],[10,3,10,5],[11,3,11,5]]}
[]
[]
[]
[]
[null,"Overheads input"]
[]
[]
[]
[null,"Name of person inputting the data"]
[null,"Record type"]
{"$rows_left_out":100}
{"sheet":"Person-days input","index":9,"n_rows":39,"n_cols":10,"rows_kept":39,"cut":false,"hidden":false,"merged":[[4,1,4,7],[37,8,37,9],[37,1,37,7],[8,1,8,3],[9,1,9,3],[10,1,10,3],[11,1,11,3],[12,1,12,3],[8,4,8,7],[9,4,9,7],[10,4,10,7],[17,3,18,3],[17,4,17,7],[18,4,18,7],[17,1,17,2],[18,1,18,2],[22,1,22,3],[11,4,11,7],[12,4,12,7]]}
[]
[]
[]
[]
[null,"Person-days input and database"]
[]
[]
[]
[null,"Name of person inputting the data"]
[null,"Record type",null,null,""]
{"$rows_left_out":30}
{"sheet":"Project input","index":10,"n_rows":37,"n_cols":19,"rows_kept":37,"cut":false,"hidden":false,"merged":[[4,1,4,10],[11,1,11,4],[12,1,12,4],[24,1,24,3],[18,7,19,7],[18,10,19,10],[18,8,19,8],[18,9,19,9],[17,1,20,4],[18,5,19,5],[18,6,19,6],[21,1,21,4],[21,5,21,10],[8,1,8,4],[13,1,13,3],[14,1,14,3],[13,4,14,4],[15,1,15,4],[8,5,8,10],[11,5,11,10],[12,5,12,10],[13,5,13,10],[14,5,14,10],[15,5,15,10],[35,14,35,16],[25,1,25,4],[23,5,23,10],[24,5,24,10],[25,5,25,10],[23,1,23,3],[23,4,24,4],[35,1,35,13],[30,4,31,4],[30,1,30,3],[31,1,31,3],[30,5,30,10],[31,5,31,10]]}
[]
[]
[]
[]
[null,"Project input and database"]
[]
[]
[]
[null,"Name of person inputting the data"]
[]
{"$rows_left_out":28}
{"sheet":"Office input","index":11,"n_rows":31,"n_cols":16,"rows_kept":31,"cut":false,"hidden":false,"merged":[[18,5,18,10],[19,5,19,10],[4,0,4,10],[8,1,8,4],[12,1,12,4],[11,5,11,10],[12,5,12,10],[8,5,8,10],[13,5,13,10],[14,5,14,10],[15,5,15,10],[16,5,16,10],[17,1,17,4],[17,5,17,10],[15,1,15,4],[19,1,19,4],[16,1,16,4],[11,1,11,4],[13,1,13,4],[14,1,14,4],[18,1,18,4],[29,12,29,15],[24,1,24,3],[24,4,25,4],[24,5,24,10],[25,1,25,3],[25,5,25,10],[29,1,29,10]]}
[]
[]
[]
[]
["Office input and database"]
[]
[]
[]
[null,"Name of person inputting the data"]
[]
{"$rows_left_out":22}
{"sheet":"Custom carbon factor input","index":12,"n_rows":29,"n_cols":13,"rows_kept":29,"cut":false,"hidden":false,"merged":[[21,1,21,2],[22,1,22,2],[16,4,16,8],[27,3,27,8],[21,3,22,3],[21,4,21,8],[22,4,22,8],[27,9,27,12],[4,1,4,8],[10,4,10,8],[10,1,10,3],[12,1,12,3],[12,4,12,8],[14,1,14,3],[11,1,11,3],[13,1,13,3],[11,4,11,8],[13,4,13,8],[14,4,14,8],[15,1,15,3],[15,4,15,8],[16,1,16,3],[27,1,27,2]]}
[]
[]
[]
[]
[null,"Custom carbon factor input and database"]
[]
[]
[]
[null,"Please ensure that any carbon factors that are input have the same boundaries and completeness as the carbon factors they are replacing."]
[null,"This will maintain consistency. "]
{"$rows_left_out":20}
{"sheet":"Overheads db","index":13,"n_rows":8,"n_cols":32,"rows_kept":8,"cut":false,"hidden":false,"merged":[[6,23,6,30],[6,0,6,9],[4,0,4,14],[6,10,6,14],[6,18,6,22],[6,15,6,17]]}
[]
[]
[]
[]
["Overheads database"]
[]
["Basic data",null,null,null,null,null,null,null,null,null,"Buildings",null,null,null,null,"Commuting",null,null,"Business travel",null,null,null,null,"Measured footprint ",null,null,null,null,null,null,null,"Misc"]
["Overhead number","Data marker","Date of entry into database","Data entry by (name)","Record type","Record data start date","Record data end date","Category","User notes","Calculation notes","Office name","Operational control","Electricity (kWh)","Renewable","Natural gas (kWh)","Fuel oil (litres)","Commuting/ homeworking footprint (tCO2e)","Number of employees","Work from home frequency (days/week)","Mode of transport","Detail","Distance","Unit","Travel cost (£)","Stationary combustion (tCO2e)","Electricity locational-based (tCO2e)","Electricity market-based (tCO2e)","Upstream emissions locational-based (tCO2e)","Upstream emissions market-based (tCO2e)","Upstream leased assets locational-based (tCO2e)","Upstream leased assets market-based (tCO2e)","Business travel (tCO2e)"]

{"sheet":"Standard carbon factor database","index":14,"n_rows":668,"n_cols":17,"rows_kept":668,"cut":false,"hidden":false,"merged":[[4,1,4,8],[6,2,6,3],[6,5,6,9]]}
[]
[]
[]
[]
[null,"Standard carbon factor database"]
[]
[null,"Basic data","Carbon factor details",null,"Biogenic","Misc",null,null,null,null,"Misc"]
[null,"Carbon factor record","Description","kgCO2e/unit","Biogenic kgCO2e/unit","Unit","Year","Source","Country","Notes","Description code"]
[null,1,"Other business services",8.3260000000000001E-2,null,"EUR",2019,"EXIOBASE","UK","Basic price factor",{"$f":"SUBSTITUTE(SUBSTITUTE(LOWER(carbonfactor_db[[#This Row],[Description]]&carbonfactor_db[[#This Row],[Unit]]&carbonfactor_db[[#This Row],[Year]]),\" \",\"\"),\"-\",\"\")","v":"otherbusinessserviceseur2019"}]
[null,2,"Rental of machinery and equipment (without operator) and of personal and household goods (services)",0.21269894749177837,null,"EUR",2019,"Speedy Hire Financial and ESG report for 2024","UK","Speedy Hire Downstream Leased Assets factor, adjusted for inflation and currency to be CO2e/EUR in 2019",{"$f":"SUBSTITUTE(SUBSTITUTE(LOWER(carbonfactor_db[[#This Row],[Description]]&carbonfactor_db[[#This Row],[Unit]]&carbonfactor_db[[#This Row],[Year]]),\" \",\"\"),\"-\",\"\")","v":"rentalofmachineryandequipment(withoutoperator)andofpersonalandhouseholdgoods(services)eur2019"}]
{"$rows_left_out":659}
{"sheet":"Emissions db","index":15,"n_rows":8,"n_cols":55,"rows_kept":8,"cut":false,"hidden":false,"merged":[[6,48,6,54],[6,0,6,11],[6,12,6,18],[6,19,6,26],[6,27,6,28],[6,29,6,47]]}
[]
[]
[]
[]
[null,"Emissions database"]
[]
["Basic data",null,null,null,null,null,null,null,null,null,null,null,"BoQ",null,null,null,null,null,null,"Soil and excavation",null,null,null,null,null,null,null,"Overheads",null,"Carbon calculations",null,null,null,null,null,null,null,null,null,null,null,null,null,null,null,null,null,null,"Helper columns"]
["Record number","Data marker","Date of entry into database","Data entry by (name)","Record type","Record data start date","Record data end date","Category","User notes","Calculation notes","Overhead number","Project code","Section","Reference","Item specification","Unit","Quantity solely for archaeology activity","Quantity for archaeology and other development purposes","Custom carbon factor (if applicable)","Country","Land use","Soil type","Peat storage months","Detail","Soil/Excavation unit","Value solely for archaeology activity","Value for archaeology and other development purposes","Office name","Operational control","Carbon factor record number","BoQ (tonnes CO2e)","Project transport (tonnes CO2e)","Project transport EVs (tonnes CO2e)","Excavation emissions (tonnes CO2e)","Upstream impacts - project specific (tonnes CO2e)","Electricity locational-based (tonnes CO2e)","Electricity market-based (tonnes CO2e)","Natural gas (tonnes CO2e)","Fuel oil (tonnes CO2e)","Leased assets [locational-based] (tonnes CO2e)","Leased assets [market-based] (tonnes CO2e)","Commuting/homeworking (tonnes CO2e)","Business travel (tonnes CO2e)","Upstream impacts - overheads [locational-based] (tonnes CO2e)","Upstream impacts - overheads [market-based] (tonnes CO2e)","Biogenic emissions (tonnes CO2e)","Development emissions [fossil] (tonnes CO2e)","Development emissions [biogenic] (tonnes CO2e)","% of record within chosen reporting period","Dashboard year - 1","% of record within chosen project reporting period and project period","Project person days in month","Total person days in month","% of overhead allocated to project","Unique code"]

{"sheet":"BoQ carbon factor db","index":16,"n_rows":160,"n_cols":6,"rows_kept":160,"cut":false,"hidden":true,"merged":[]}
[]
[null,"Reference","Item specification","Carbon factor unit","Physical units carbon factor","Exiobase carbon factor description"]
[null,"A - PRELIMINARIES",null,null,null,""]
[null,"A1","Supply H&S Plan","hours","Homeworking (office equipment + heating)","Other business services"]
[null,"A2 - Supply and update 'WSI' or Method Statement "]
[null,"A2.1","Supply  'WSI' or Method Statement","hours","Homeworking (office equipment + heating)","Other business services"]
[null,"A2.2","Update  'WSI' or Method Statement","hours","Homeworking (office equipment + heating)","Other business services"]
[null,"A3 - Supply and update Programme"]
[null,"A3.1","Supply  Programme","hours","Homeworking (office equipment + heating)","Other business services"]
[null,"A3.2","Update Programme","hours","Homeworking (office equipment + heating)","Other business services"]
{"$rows_left_out":151}
{"sheet":"userName","index":17,"n_rows":1,"n_cols":1,"rows_kept":1,"cut":false,"hidden":true,"merged":[]}
["CS"]

{"sheet":"Carbon factor dropdowns","index":18,"n_rows":86,"n_cols":22,"rows_kept":86,"cut":false,"hidden":true,"merged":[]}
[]
["Counties",null,"Travel mode","Car dropdown","Rail dropdown","Taxi dropdown","Flight dropdown","Ferry dropdown","Van dropdown",null,null,null,"Soil location dropdown","Previous Landuse dropdown","Dug Depth (cm) dropdwon","Soil Type dropdwon","Area undergoing soil movement dropdown",null,"Excavator type","Unit",null,"CIBSE category"]
["Bedfordshire",null,"Car","average unknown fuel","national","regular taxi","Domestic, to/from UK - average passenger","Inland","Class I (up to 1.305 tonnes) diesel",null,null,null,"England","Seminatural","0-30","Organic","Ha",null,"White diesel powered excavator","hour",null,"Office - cellular naturally ventilated"]
["Berkshire",null,"Bus","small unknown fuel","international","black cab","Short-haul, to/from UK - average passenger","Coastal","Class II (1.305 to 1.74 tonnes) diesel",null,null,null,"Scotland","Pasture","30-100","Organo-minerals","m2",null,"Biodiesel excavator","m3",null,"Office - open plan naturally ventilated"]
["Bristol",null,"Rail","medium unknown fuel",null,null,"Short-haul, to/from UK - economy class",null,"Class III (1.74 to 3.5 tonnes) diesel",null,null,null,"Wales","Arable","0-100","Mineral soils","sq mile",null,"Electric Excavator - charged from UK mains",null,null,"Office - standard air conditioned"]
["Buckinghamshire",null,"Taxi","large unknown fuel",null,null,"Short-haul, to/from UK - business class",null,"Average (up to 3.5 tonnes) diesel",null,null,null,"Northern Ireland","Woodland",null,null,"sq km",null,"Electric excavator - renewable power",null,null,"Office - prestige air conditioned"]
["Cambridgeshire",null,"Tram","small diesel",null,null,"Long-haul, to/from UK - average passenger",null,"Class I (up to 1.305 tonnes) petrol",null,null,null,null,"Gardens",null,null,null,null,null,null,null,"Warehouse"]
["Cheshire",null,"London Underground","medium diesel",null,null,"Long-haul, to/from UK - economy class",null,"Class II (1.305 to 1.74 tonnes) petrol"]
["Cornwall",null,"Flight","large diesel",null,null,"Long-haul, to/from UK - premium economy class",null,"Class III (1.74 to 3.5 tonnes) petrol"]
["Cumbria",null,"Ferry","unknown size diesel",null,null,"Long-haul, to/from UK - business class",null,"Average (up to 3.5 tonnes) petrol"]
{"$rows_left_out":77}
{"sheet":"Conversion factors","index":19,"n_rows":25,"n_cols":26,"rows_kept":25,"cut":false,"hidden":true,"merged":[]}
[]
[]
[]
[]
[null,"Conversion factors"]
[null,null,null,null,null,null,null,null,null,null,null,null,null,null,null,null,null,null,null,"HMRC exchange rates","Bank of England inflation calculator"]
[null,"Name","Value","Source",null,"CIBSE category","Electricity - typical practice (kWh/m2/year)","Fossil fuels - typical practice (kWh/m2/year)","Year","Notes",null,"Fuel","Year","Average fuel rate (£/litre)","Source","Description code",null,"Reporting year","Exiobase year","GBP to EUR in Exiobase year","GBP in reporting year to GBP in Exiobase year","Conversion factor","Description code",null,"Month","GBP to EUR"]
[null,"GWP of CH4",28,"Fifth assessment report (AR5)",null,"Office - cellular naturally ventilated",54,151,2024,null,null,"Diesel",2022,{"$f":"177.78/100","v":1.7778},"gov.uk",{"$f":"SUBSTITUTE(SUBSTITUTE(LOWER(L8&M8),\" \",\"\"),\"-\",\"\")","v":"diesel2022"},null,2025,2019,{"$f":"Z20","v":1.1377583333333336},0.78,{"$f":"exiobase_currency_inflation[[#This Row],[GBP in reporting year to GBP in Exiobase year]]*exiobase_currency_inflation[[#This Row],[GBP to EUR in Exiobase year]]","v":0.88745150000000028},{"$f":"exiobase_currency_inflation[[#This Row],[Reporting year]]&exiobase_currency_inflation[[#This Row],[Exiobase year]]","v":"20252019"},null,"2019-01-01",1.1069]
[null,"On-road EV charging",75,"p/kWh [2024]",null,"Office - open plan naturally ventilated",85,151,2024,null,null,"Diesel",2023,{"$f":"158.12/100","v":1.5811999999999999},"gov.uk","diesel2023",null,2024,2019,{"$f":"Z20","v":1.1377583333333336},0.8,{"$f":"exiobase_currency_inflation[[#This Row],[GBP in reporting year to GBP in Exiobase year]]*exiobase_currency_inflation[[#This Row],[GBP to EUR in Exiobase year]]","v":0.91020666666666694},{"$f":"exiobase_currency_inflation[[#This Row],[Reporting year]]&exiobase_currency_inflation[[#This Row],[Exiobase year]]","v":"20242019"},null,"2019-02-01",1.1478999999999999]
[null,null,null,null,null,"Office - standard air conditioned",226,178,2024,null,null,"Diesel",2024,{"$f":"149.31/100","v":1.4931000000000001},"gov.uk","diesel2024",null,2023,2019,{"$f":"Z20","v":1.1377583333333336},0.82,{"$f":"exiobase_currency_inflation[[#This Row],[GBP in reporting year to GBP in Exiobase year]]*exiobase_currency_inflation[[#This Row],[GBP to EUR in Exiobase year]]","v":0.93296183333333349},{"$f":"exiobase_currency_inflation[[#This Row],[Reporting year]]&exiobase_currency_inflation[[#This Row],[Exiobase year]]","v":"20232019"},null,"2019-03-01",1.1511]
{"$rows_left_out":16}
{"sheet":"Clients_projects","index":20,"n_rows":3,"n_cols":5,"rows_kept":3,"cut":false,"hidden":true,"merged":[]}
[]
[null,"Client dropdown",null,"Column1","EA"]
[null,"EA",null,null,"Test"]

{"sheet":"Locations_projects","index":21,"n_rows":86,"n_cols":8,"rows_kept":86,"cut":false,"hidden":true,"merged":[]}
[]
[null,"Location list",null,"Location dropdown",null,"Column1","Buckinghamshire","Bristol"]
[null,"Bristol",null,"Bedfordshire",null,null,null,"Test"]
[null,null,null,"Berkshire"]
[null,null,null,"Bristol"]
[null,null,null,"Buckinghamshire"]
[null,null,null,"Cambridgeshire"]
[null,null,null,"Cheshire"]
[null,null,null,"Cornwall"]
[null,null,null,"Cumbria"]
{"$rows_left_out":77}
{"sheet":"Emission table","index":22,"n_rows":38,"n_cols":43,"rows_kept":38,"cut":false,"hidden":true,"merged":[[18,31,19,32],[18,41,19,42],[18,20,19,21],[4,1,4,19],[10,13,10,14],[10,15,10,16]]}
[]
[]
[]
[]
[null,"Emission table"]
[null,"Start date","End date",null,null,null,null,null,null,"Project code",{"$f":"VLOOKUP(Dashboard!dashboard_project,project_db[[#All],[Project name]:[Project code]],2,FALSE)","v":{"$error":"#N/A"}},null,null,null,null,null,null,null,null,null,null,null,null,null,"Client","EA",null,null,null,null,null,null,null,null,"Location","Buckinghamshire"]
[null,{"$f":"Dashboard!dashboard_yr_startdate","v":"00:00:00"},{"$f":"Dashboard!dashboard_yr_enddate","v":"00:00:00"},null,null,null,null,null,null,"Project start date",{"$f":"VLOOKUP(proj_code,project_db[[#All],[Project code]:[Expected end date]],MATCH(\"Expected start date\",project_db[[#Headers],[Project code]:[Expected end date]],0),FALSE)","v":{"$error":"#N/A"}},null,null,null,null,null,null,null,null,null,null,null,null,null,"Start date","2025-04-01",null,null,null,null,null,null,null,null,"Start date","2025-01-01"]
["Period in previous year",{"$f":"DATE(YEAR(Dashboard!dashboard_yr_startdate)-1,MONTH(Dashboard!dashboard_yr_startdate),DAY(Dashboard!dashboard_yr_startdate))","v":"3798-12-31"},{"$f":"DATE(YEAR(Dashboard!dashboard_yr_enddate)-1,MONTH(Dashboard!dashboard_yr_enddate),DAY(Dashboard!dashboard_yr_enddate))","v":"3798-12-31"},null,null,null,null,null,null,"Project end date",{"$f":"VLOOKUP(proj_code,project_db[[#All],[Project code]:[Expected end date]],MATCH(\"Expected end date\",project_db[[#Headers],[Project code]:[Expected end date]],0),FALSE)","v":{"$error":"#N/A"}},null,null,null,null,null,null,null,null,null,null,null,null,null,"End date","2025-05-01",null,null,null,null,null,null,null,null,"End date","2025-12-31"]
[null,null,null,null,null,null,null,null,null,null,null,null,null,null,null,null,null,null,null,null,null,null,null,null,"Market/locational","Locational-based",null,null,null,null,null,null,null,null,"Market/locational","Market-based"]
[null,"Annual table",{"$f":"Dashboard!lastyear_label","v":"1/1/2024 - 1/1/2025"},{"$f":"Dashboard!thisyear_label","v":"1/1/2025 - 1/1/2026"},null,null,null,{"$f":"\"Tonnes CO2e \"&Dashboard!thisyear_label","v":"Tonnes CO2e 1/1/2025 - 1/1/2026"},null,"Project person days in overlap period/Total person days in overlap period",{"$f":"IFERROR(SUMPRODUCT((persondays_db[Record type]= \"Forecast\")* (persondays_db[Data marker]= \"live\") * (#REF!) * (persondays_db[Person-days])*(persondays_db[Project code]=proj_code))/SUMPRODUCT((persondays_db[Record type]= \"Forecast\")* (persondays_db[Data marker]= \"live\") * (#REF!) * (persondays_db[Person-days])*(persondays_db[Resolution]=\"Total company\")),0)","v":0},{"$f":"IFERROR(SUMPRODUCT((persondays_db[Record type]= \"Actual\")* (persondays_db[Data marker]= \"live\") * (#REF!) * (persondays_db[Person-days])*(persondays_db[Project code]=proj_code))/SUMPRODUCT((persondays_db[Record type]= \"Actual\")* (persondays_db[Data marker]= \"live\") * (#REF!) * (persondays_db[Person-days])*(persondays_db[Resolution]=\"Total company\")),0)","v":0},"Project table",null,null,null,null,null,null,null,null,null,null,null,"Client table",null,null,null,null,null,null,null,null,null,"Location table"]
{"$rows_left_out":29}
{"sheet":"FrontSheet","index":23,"n_rows":38,"n_cols":4,"rows_kept":38,"cut":false,"hidden":true,"merged":[[26,1,30,3],[32,1,34,3],[37,1,39,3],[21,1,23,3]]}
[]
[null,"This document displays carbon emissions data for:"]
[null,"Client"]
[null,"Location"]
[null,"Project(s)"]
[null,"The data represents emissions in the following period:"]
[null,"Start date"]
[null,"End date"]
[]
[null,"The emissions are split into the following categories:"]
{"$rows_left_out":29}
{"sheet":"Summary","index":24,"n_rows":0,"n_cols":0,"rows_kept":0,"cut":false,"hidden":true,"merged":[]}